{"text_format":"1","workbook":"xlsx","n_sheets":8,"sheets":["Summary","Project Input","Option A","Option B","Option C","WL Options","WL Prefered","Data"],"not_rendered":{"charts":7,"images":11,"macros":1,"external_links":0,"defined_names":34,"comments":0,"pivot_tables":0},"unopened":[],"bounds":{"document_bytes":16777216,"sheet_cells":100000,"rows_first":2000,"rows_last":500,"rows_between":2000,"halvings":0,"cell_chars":16384,"cell_head_chars":4096},"cells_cut":0,"cells_raw":0,"read":"whole","date_system":"1900"}

{"sheet":"Summary","index":0,"n_rows":52,"n_cols":2,"rows_kept":52,"cut":false,"hidden":false,"merged":[[20,0,21,6],[23,0,24,6],[26,0,27,6]]}
["WHOLE LIFE APPRAISAL TOOL"]
[]
["Toolkit Version 1.5"]
[]
[]
[]
{"$rows_left_out":47}
{"sheet":"Project Input","index":1,"n_rows":116,"n_cols":15,"rows_kept":116,"cut":false,"hidden":false,"merged":[[96,0,96,5],[84,0,87,6],[88,0,91,6],[92,0,95,6],[96,6,96,11],[18,14,18,17],[35,1,36,2],[35,0,36,0],[78,0,79,0],[6,7,6,14],[75,0,75,2],[46,0,46,2],[48,7,48,14],[62,0,63,0],[62,1,63,1],[62,2,63,2],[13,14,13,17],[14,14,14,17],[15,14,15,17],[16,14,16,17],[17,14,17,17],[8,14,8,17],[9,14,9,17],[10,14,10,17],[11,14,11,17],[12,14,12,17],[21,14,21,17],[22,14,22,17],[23,14,23,17],[24,14,24,17],[25,14,25,17],[26,14,26,17],[27,14,27,17],[28,14,28,17],[29,14,29,17],[30,14,30,17],[31,14,31,17],[35,6,36,6],[62,6,63,6],[80,0,83,6],[78,1,79,6],[69,1,69,2],[70,1,70,2],[71,1,71,2],[72,1,72,2],[78,9,79,11],[64,1,64,2],[65,1,65,2],[66,1,66,2],[67,1,67,2],[68,1,68,2]]}
["OPTION ANALYSIS -  WHOLE LIFE OUTCOMES ANALYSIS"]
["Project Input Sheet "]
[]
["Base Data"]
["Base data to inform lifecycle model and WLC dashboard. ",null,null,null,null,"Date:","2019-03-06",{"$f":" MATCH('WL Prefered'!AA5, D7:F7, 0)","v":1}]
[null,null,null,null,null,"Revision ","B"]
{"$rows_left_out":111}
{"sheet":"Option A","index":2,"n_rows":213,"n_cols":72,"rows_kept":213,"cut":false,"hidden":false,"merged":[[49,3,49,6],[50,3,50,6],[51,3,51,6],[52,3,52,6],[53,3,53,6],[54,3,54,6],[55,3,55,6],[205,1,205,6],[120,1,120,3],[121,1,121,3],[122,1,122,3],[139,1,139,4],[141,1,141,4],[142,1,142,4],[183,1,183,6],[184,1,184,6],[163,1,163,6],[140,1,140,4],[160,1,160,6],[161,1,161,6],[162,1,162,6],[96,3,96,5],[97,3,97,5],[99,3,99,5],[13,28,13,30],[14,28,14,30],[15,28,15,30],[16,28,16,30],[201,1,201,6],[202,1,202,6],[203,1,203,6],[204,1,204,6],[15,12,15,13],[17,8,17,11],[34,1,34,6],[35,1,35,6],[36,1,36,6],[37,1,37,6],[47,3,47,6],[48,3,48,6],[58,1,58,6],[56,1,56,6],[57,1,57,6],[101,1,101,5],[118,1,118,3],[119,1,119,3],[114,2,114,3],[85,3,85,5],[17,28,17,30],[11,8,11,11],[12,8,12,11],[13,8,13,11],[14,8,14,11],[15,8,15,11],[7,8,7,11],[13,16,13,17],[16,12,16,13],[14,16,14,17],[15,16,15,17],[16,16,16,17],[8,28,8,30],[9,28,9,30],[10,28,10,30],[11,28,11,30],[12,28,12,30],[9,21,9,23],[10,21,10,23],[11,21,11,23],[12,21,12,23],[8,16,8,17],[9,16,9,17],[10,16,10,17],[38,1,38,6],[1,39,3,50],[6,21,6,23],[6,16,6,17],[6,18,6,19],[7,21,7,23],[7,16,7,17],[6,28,6,30],[1,35,1,37],[3,35,3,37],[6,24,6,25],[7,28,7,30],[6,8,6,11],[8,8,8,11],[9,8,9,11],[10,8,10,11],[17,12,17,13],[17,16,17,17],[17,21,17,23],[13,21,13,23],[14,21,14,23],[15,21,15,23],[16,21,16,23],[8,21,8,23],[6,3,6,6],[6,1,6,2],[7,1,7,2],[8,1,8,2],[19,0,19,6],[7,12,7,13],[8,12,8,13],[9,12,9,13],[10,12,10,13],[11,12,11,13],[12,12,12,13],[13,12,13,13],[14,12,14,13],[16,8,16,11],[6,12,6,13],[11,16,11,17],[6,14,6,15],[12,16,12,17],[20,0,20,6],[66,0,67,3],[44,0,45,3],[149,0,150,3],[59,1,59,6],[60,1,60,6],[25,0,25,6],[26,0,26,6],[28,3,28,6],[29,3,29,6],[30,3,30,6],[31,3,31,6],[32,3,32,6],[33,3,33,6],[69,3,69,5],[70,3,70,5],[71,3,71,5],[92,3,92,5],[93,3,93,5],[94,3,94,5],[95,3,95,5],[211,0,212,3],[76,1,76,5],[75,1,75,5],[74,1,74,5],[73,1,73,5],[72,1,72,5],[128,0,129,3],[111,0,112,3],[82,0,83,3],[143,1,143,4],[102,1,102,5],[103,1,103,5],[104,1,104,5],[105,1,105,5],[164,1,164,6],[180,1,180,6],[181,1,181,6],[182,1,182,6],[87,3,87,5],[88,3,88,5],[89,3,89,5],[90,3,90,5],[91,3,91,5],[86,3,86,5],[100,3,100,5],[131,3,131,4],[132,3,132,4],[133,3,133,4],[134,3,134,4],[135,3,135,4],[136,3,136,4],[98,3,98,5],[137,3,137,4],[115,2,115,3],[116,2,116,3],[117,2,117,3],[138,3,138,4],[152,3,152,6],[153,3,153,6],[154,3,154,6],[155,3,155,6],[156,3,156,6],[157,3,157,6],[158,3,158,6],[159,3,159,6],[173,3,173,6],[174,3,174,6],[175,3,175,6],[176,3,176,6],[177,3,177,6],[170,0,171,3],[200,3,200,6],[178,3,178,6],[179,3,179,6],[193,3,193,6],[194,3,194,6],[195,3,195,6],[196,3,196,6],[197,3,197,6],[198,3,198,6],[199,3,199,6],[190,0,191,3]]}
[]
[null,{"$f":"'Project Input'!D9","v":"East Ayrshire Council"},null,null,null,null,null,null,null,null,null,null,null,null,null,null,null,null,null,null,null,null,null,null,null,null,null,null,null,null,null,null,null,null,"Date:",{"$f":"'Project Input'!G5","v":"2019-03-06"},null,null,null,"OPTION A INPUTS"]
[]
[null,{"$f":"'Project Input'!D10","v":"EAC Ref Design"},null,null,null,null,null,null,"OPTION A INPUTS",null,null,null,{"$f":"'Project Input'!D8","v":"EAC Early Years Facility"},null,null,null,null,null,null,null,null,null,null,null,null,null,null,null,null,null,null,null,null,null,"Revision:",{"$f":"'Project Input'!D25","v":0}]
[]
[]
{"$rows_left_out":208}
{"sheet":"Option B","index":3,"n_rows":213,"n_cols":72,"rows_kept":213,"cut":false,"hidden":false,"merged":[[1,35,1,37],[1,39,3,50],[3,35,3,37],[6,1,6,2],[6,3,6,6],[6,8,6,11],[6,12,6,13],[6,14,6,15],[6,16,6,17],[6,18,6,19],[8,1,8,2],[8,8,8,11],[8,12,8,13],[8,16,8,17],[8,21,8,23],[8,28,8,30],[6,21,6,23],[6,24,6,25],[6,28,6,30],[7,1,7,2],[7,8,7,11],[7,12,7,13],[7,16,7,17],[7,21,7,23],[7,28,7,30],[9,8,9,11],[9,12,9,13],[9,16,9,17],[9,21,9,23],[9,28,9,30],[10,8,10,11],[10,12,10,13],[10,16,10,17],[10,21,10,23],[10,28,10,30],[11,8,11,11],[11,12,11,13],[11,16,11,17],[11,21,11,23],[11,28,11,30],[12,8,12,11],[12,12,12,13],[12,16,12,17],[12,21,12,23],[12,28,12,30],[13,8,13,11],[13,12,13,13],[13,16,13,17],[13,21,13,23],[13,28,13,30],[14,8,14,11],[14,12,14,13],[14,16,14,17],[14,21,14,23],[14,28,14,30],[17,8,17,11],[17,12,17,13],[17,16,17,17],[17,21,17,23],[17,28,17,30],[19,0,19,6],[15,8,15,11],[15,12,15,13],[15,16,15,17],[15,21,15,23],[15,28,15,30],[16,8,16,11],[16,12,16,13],[16,16,16,17],[16,21,16,23],[16,28,16,30],[20,0,20,6],[25,0,25,6],[26,0,26,6],[34,1,34,6],[35,1,35,6],[36,1,36,6],[28,3,28,6],[29,3,29,6],[30,3,30,6],[31,3,31,6],[32,3,32,6],[33,3,33,6],[97,3,97,5],[98,3,98,5],[99,3,99,5],[37,1,37,6],[38,1,38,6],[44,0,45,3],[56,1,56,6],[57,1,57,6],[58,1,58,6],[47,3,47,6],[48,3,48,6],[49,3,49,6],[50,3,50,6],[51,3,51,6],[52,3,52,6],[88,3,88,5],[89,3,89,5],[90,3,90,5],[91,3,91,5],[92,3,92,5],[93,3,93,5],[94,3,94,5],[95,3,95,5],[96,3,96,5],[139,1,139,4],[140,1,140,4],[141,1,141,4],[104,1,104,5],[105,1,105,5],[111,0,112,3],[118,1,118,3],[119,1,119,3],[120,1,120,3],[135,3,135,4],[136,3,136,4],[137,3,137,4],[138,3,138,4],[163,1,163,6],[164,1,164,6],[170,0,171,3],[180,1,180,6],[181,1,181,6],[182,1,182,6],[142,1,142,4],[143,1,143,4],[149,0,150,3],[160,1,160,6],[161,1,161,6],[162,1,162,6],[152,3,152,6],[153,3,153,6],[154,3,154,6],[155,3,155,6],[156,3,156,6],[157,3,157,6],[158,3,158,6],[159,3,159,6],[173,3,173,6],[174,3,174,6],[175,3,175,6],[176,3,176,6],[204,1,204,6],[205,1,205,6],[211,0,212,3],[183,1,183,6],[184,1,184,6],[190,0,191,3],[201,1,201,6],[202,1,202,6],[203,1,203,6],[199,3,199,6],[200,3,200,6],[53,3,53,6],[54,3,54,6],[55,3,55,6],[69,3,69,5],[70,3,70,5],[71,3,71,5],[85,3,85,5],[86,3,86,5],[87,3,87,5],[75,1,75,5],[76,1,76,5],[82,0,83,3],[59,1,59,6],[60,1,60,6],[66,0,67,3],[72,1,72,5],[73,1,73,5],[74,1,74,5],[100,3,100,5],[114,2,114,3],[115,2,115,3],[116,2,116,3],[117,2,117,3],[131,3,131,4],[132,3,132,4],[133,3,133,4],[134,3,134,4],[121,1,121,3],[122,1,122,3],[128,0,129,3],[101,1,101,5],[102,1,102,5],[103,1,103,5],[177,3,177,6],[178,3,178,6],[179,3,179,6],[193,3,193,6],[194,3,194,6],[195,3,195,6],[196,3,196,6],[197,3,197,6],[198,3,198,6]]}
[]
[null,{"$f":"'Project Input'!E9","v":0},null,null,null,null,null,null,null,null,null,null,null,null,null,null,null,null,null,null,null,null,null,null,null,null,null,null,null,null,null,null,null,null,"Date:",{"$f":"'Project Input'!G5","v":"2019-03-06"},null,null,null,"OPTION B INPUTS"]
[]
[null,{"$f":"'Project Input'!E10","v":0},null,null,null,null,null,null,"OPTION B INPUTS",null,null,null,{"$f":"'Project Input'!E8","v":"Not used"},null,null,null,null,null,null,null,null,null,null,null,null,null,null,null,null,null,null,null,null,null,"Revision:",{"$f":"'Project Input'!E25","v":0}]
[]
[]
{"$rows_left_out":208}
{"sheet":"Option C","index":4,"n_rows":213,"n_cols":72,"rows_kept":213,"cut":false,"hidden":false,"merged":[[1,35,1,37],[1,39,3,50],[3,35,3,37],[6,1,6,2],[6,3,6,6],[6,8,6,11],[6,12,6,13],[6,14,6,15],[6,16,6,17],[6,18,6,19],[8,1,8,2],[8,8,8,11],[8,12,8,13],[8,16,8,17],[8,21,8,23],[8,28,8,30],[6,21,6,23],[6,24,6,25],[6,28,6,30],[7,1,7,2],[7,8,7,11],[7,12,7,13],[7,16,7,17],[7,21,7,23],[7,28,7,30],[9,8,9,11],[9,12,9,13],[9,16,9,17],[9,21,9,23],[9,28,9,30],[10,8,10,11],[10,12,10,13],[10,16,10,17],[10,21,10,23],[10,28,10,30],[11,8,11,11],[11,12,11,13],[11,16,11,17],[11,21,11,23],[11,28,11,30],[12,8,12,11],[12,12,12,13],[12,16,12,17],[12,21,12,23],[12,28,12,30],[13,8,13,11],[13,12,13,13],[13,16,13,17],[13,21,13,23],[13,28,13,30],[14,8,14,11],[14,12,14,13],[14,16,14,17],[14,21,14,23],[14,28,14,30],[17,8,17,11],[17,12,17,13],[17,16,17,17],[17,21,17,23],[17,28,17,30],[19,0,19,6],[15,8,15,11],[15,12,15,13],[15,16,15,17],[15,21,15,23],[15,28,15,30],[16,8,16,11],[16,12,16,13],[16,16,16,17],[16,21,16,23],[16,28,16,30],[20,0,20,6],[25,0,25,6],[26,0,26,6],[34,1,34,6],[35,1,35,6],[36,1,36,6],[28,3,28,6],[29,3,29,6],[30,3,30,6],[31,3,31,6],[32,3,32,6],[33,3,33,6],[97,3,97,5],[98,3,98,5],[99,3,99,5],[37,1,37,6],[38,1,38,6],[44,0,45,3],[56,1,56,6],[57,1,57,6],[58,1,58,6],[47,3,47,6],[48,3,48,6],[49,3,49,6],[50,3,50,6],[51,3,51,6],[52,3,52,6],[88,3,88,5],[89,3,89,5],[90,3,90,5],[91,3,91,5],[92,3,92,5],[93,3,93,5],[94,3,94,5],[95,3,95,5],[96,3,96,5],[139,1,139,4],[140,1,140,4],[141,1,141,4],[104,1,104,5],[105,1,105,5],[111,0,112,3],[118,1,118,3],[119,1,119,3],[120,1,120,3],[135,3,135,4],[136,3,136,4],[137,3,137,4],[138,3,138,4],[163,1,163,6],[164,1,164,6],[170,0,171,3],[180,1,180,6],[181,1,181,6],[182,1,182,6],[142,1,142,4],[143,1,143,4],[149,0,150,3],[160,1,160,6],[161,1,161,6],[162,1,162,6],[152,3,152,6],[153,3,153,6],[154,3,154,6],[155,3,155,6],[156,3,156,6],[157,3,157,6],[158,3,158,6],[159,3,159,6],[173,3,173,6],[174,3,174,6],[175,3,175,6],[176,3,176,6],[204,1,204,6],[205,1,205,6],[211,0,212,3],[183,1,183,6],[184,1,184,6],[190,0,191,3],[201,1,201,6],[202,1,202,6],[203,1,203,6],[199,3,199,6],[200,3,200,6],[53,3,53,6],[54,3,54,6],[55,3,55,6],[69,3,69,5],[70,3,70,5],[71,3,71,5],[85,3,85,5],[86,3,86,5],[87,3,87,5],[75,1,75,5],[76,1,76,5],[82,0,83,3],[59,1,59,6],[60,1,60,6],[66,0,67,3],[72,1,72,5],[73,1,73,5],[74,1,74,5],[100,3,100,5],[114,2,114,3],[115,2,115,3],[116,2,116,3],[117,2,117,3],[131,3,131,4],[132,3,132,4],[133,3,133,4],[134,3,134,4],[121,1,121,3],[122,1,122,3],[128,0,129,3],[101,1,101,5],[102,1,102,5],[103,1,103,5],[177,3,177,6],[178,3,178,6],[179,3,179,6],[193,3,193,6],[194,3,194,6],[195,3,195,6],[196,3,196,6],[197,3,197,6],[198,3,198,6]]}
[]
[null,{"$f":"'Project Input'!F9","v":0},null,null,null,null,null,null,null,null,null,null,null,null,null,null,null,null,null,null,null,null,null,null,null,null,null,null,null,null,null,null,null,null,"Date:",{"$f":"'Project Input'!G5","v":"2019-03-06"},null,null,null,"OPTION C INPUTS"]
[]
[null,{"$f":"'Project Input'!F10","v":0},null,null,null,null,null,null,"OPTION C INPUTS",null,null,null,{"$f":"'Project Input'!F8","v":"Not used"},null,null,null,null,null,null,null,null,null,null,null,null,null,null,null,null,null,null,null,null,null,"Revision:",{"$f":"'Project Input'!F25","v":0}]
[]
[]
{"$rows_left_out":208}
{"sheet":"WL Options","index":5,"n_rows":66,"n_cols":39,"rows_kept":66,"cut":false,"hidden":false,"merged":[[29,0,29,2],[29,3,29,5],[38,21,38,23],[38,24,38,26],[38,27,38,29],[47,30,47,32],[47,27,47,29],[46,30,46,32],[47,24,47,26],[45,24,45,26],[39,30,39,32],[40,0,44,11],[36,0,39,11],[32,0,35,11],[32,21,32,23],[41,24,41,26],[45,0,50,11],[45,27,45,29],[45,30,45,32],[48,24,48,26],[48,27,48,29],[48,30,48,32],[38,30,38,32],[40,24,40,26],[26,3,26,5],[26,6,26,8],[26,9,26,11],[27,3,27,5],[27,6,27,8],[27,9,27,11],[35,30,35,32],[37,24,37,26],[34,30,34,32],[30,30,31,32],[26,24,27,26],[26,27,27,29],[26,16,27,16],[26,17,27,17],[26,18,27,18],[28,24,29,26],[28,23,29,23],[28,20,29,20],[29,6,29,8],[29,9,29,11],[32,27,32,29],[32,30,32,32],[26,0,26,2],[27,0,27,2],[55,30,55,32],[46,27,46,29],[59,30,59,32],[59,24,59,26],[26,22,27,22],[26,20,27,20],[30,22,31,23],[33,30,33,32],[40,27,40,29],[40,30,40,32],[36,27,36,29],[36,24,36,26],[36,30,36,32],[37,30,37,32],[28,27,29,29],[28,30,29,32],[30,24,31,26],[35,27,35,29],[42,24,42,26],[41,27,41,29],[56,30,56,32],[56,27,56,29],[65,27,65,29],[64,27,64,29],[57,30,57,32],[57,27,57,29],[57,24,57,26],[28,19,29,19],[37,21,37,23],[42,27,42,29],[41,30,41,32],[42,30,42,32],[43,22,44,23],[50,30,50,32],[49,24,49,26],[49,27,49,29],[49,30,49,32],[46,24,46,26],[43,24,44,26],[43,27,44,29],[43,30,44,32],[51,24,52,26],[51,27,52,29],[62,24,62,26],[62,27,62,29],[62,30,62,32],[65,3,65,5],[65,6,65,8],[65,9,65,11],[62,3,62,5],[62,6,62,8],[62,9,62,11],[63,3,63,5],[63,6,63,8],[63,9,63,11],[64,3,64,5],[64,6,64,8],[64,9,64,11],[65,30,65,32],[60,27,61,29],[60,30,61,32],[63,27,63,29],[63,30,63,32],[63,24,63,26],[8,15,9,15],[8,27,9,29],[8,30,9,32],[12,27,13,29],[10,27,11,29],[10,30,11,32],[12,30,13,32],[14,20,15,20],[16,18,17,18],[16,19,17,19],[16,20,17,20],[8,17,9,17],[8,18,9,18],[8,19,9,19],[8,16,9,16],[16,15,17,15],[10,15,11,15],[65,24,65,26],[14,30,15,32],[16,27,17,29],[18,27,19,29],[20,27,21,29],[14,27,15,29],[14,24,15,26],[24,22,25,22],[24,21,25,21],[64,30,64,32],[59,27,59,29],[64,24,64,26],[53,24,53,26],[54,24,54,26],[55,24,55,26],[53,27,53,29],[54,27,54,29],[55,27,55,29],[53,30,53,32],[54,30,54,32],[58,27,58,29],[58,30,58,32],[58,24,58,26],[56,24,56,26],[51,30,52,32],[51,22,52,23],[23,0,23,2],[24,0,24,2],[26,23,27,23],[30,0,31,11],[39,24,39,26],[39,27,39,29],[22,24,23,26],[24,24,25,26],[34,24,34,26],[34,27,34,29],[30,27,31,29],[35,24,35,26],[37,27,37,29],[25,3,25,5],[25,6,25,8],[25,9,25,11],[26,12,27,14],[28,0,28,2],[28,3,28,5],[28,6,28,8],[28,9,28,11],[24,23,25,23],[22,15,23,15],[22,12,23,14],[22,19,23,19],[22,20,23,20],[18,12,19,14],[20,12,21,14],[24,12,25,14],[18,15,19,15],[22,16,23,16],[22,17,23,17],[20,18,21,18],[20,19,21,19],[20,20,21,20],[20,16,21,16],[20,17,21,17],[22,18,23,18],[24,18,25,18],[18,18,19,18],[24,16,25,16],[18,19,19,19],[18,20,19,20],[24,20,25,20],[23,6,23,8],[23,9,23,11],[24,6,24,8],[24,9,24,11],[22,3,22,5],[23,3,23,5],[24,3,24,5],[20,3,20,5],[22,9,22,11],[20,6,20,8],[20,9,20,11],[21,6,21,8],[21,9,21,11],[22,6,22,8],[21,3,21,5],[18,0,19,2],[6,3,7,5],[10,3,11,5],[12,3,13,5],[14,3,15,5],[16,3,17,5],[18,3,19,5],[12,0,13,1],[12,2,13,2],[10,0,11,1],[10,2,11,2],[8,3,9,5],[8,0,9,2],[16,0,17,2],[6,0,7,2],[14,0,15,2],[16,12,17,14],[14,16,15,16],[14,17,15,17],[16,16,17,16],[14,15,15,15],[14,6,15,8],[16,6,17,8],[16,9,17,11],[18,6,19,8],[18,9,19,11],[14,9,15,11],[14,12,15,14],[6,6,7,8],[6,9,7,11],[10,6,11,8],[10,9,11,11],[12,6,13,8],[12,9,13,11],[8,6,9,8],[8,9,9,11],[2,24,2,26],[6,18,6,20],[6,12,7,14],[8,21,9,21],[8,22,9,22],[10,12,11,14],[12,12,13,14],[8,12,9,14],[12,18,13,18],[12,17,13,17],[12,16,13,16],[12,20,13,20],[12,19,13,19],[8,23,9,23],[10,21,11,21],[8,20,9,20],[4,30,4,32],[3,23,3,26],[26,35,27,35],[24,30,25,32],[22,30,23,32],[33,27,33,29],[22,27,23,29],[24,27,25,29],[10,22,11,22],[10,23,11,23],[33,21,33,23],[16,24,17,26],[12,24,13,26],[14,21,15,21],[14,22,15,22],[14,23,15,23],[16,21,17,21],[16,22,17,22],[16,23,17,23],[22,23,23,23],[12,21,13,21],[12,22,13,22],[12,23,13,23],[20,30,21,32],[10,19,11,19],[10,20,11,20],[8,24,9,26],[10,24,11,26],[6,21,7,32],[6,15,6,17],[10,16,11,16],[10,18,11,18],[10,17,11,17],[2,0,2,2],[3,0,3,2],[26,30,27,32],[51,0,52,11],[50,24,50,26],[50,27,50,29],[18,30,19,32],[16,30,17,32],[24,15,25,15],[22,21,23,21],[22,22,23,22],[24,19,25,19],[18,24,19,26],[20,24,21,26],[14,18,15,18],[14,19,15,19],[16,17,17,17],[18,16,19,16],[18,17,19,17],[12,15,13,15],[4,23,4,29],[2,27,2,29],[3,27,3,29],[2,11,3,22],[60,22,61,23],[60,24,61,26],[45,17,46,17],[18,21,19,21],[18,22,19,22],[18,23,19,23],[20,21,21,21],[20,22,21,22],[20,23,21,23],[24,17,25,17],[28,18,29,18],[30,12,31,20],[28,12,29,14],[28,15,29,15],[28,21,29,21],[28,22,29,22],[28,17,29,17],[28,16,29,16],[26,15,27,15],[26,19,27,19],[26,21,27,21],[32,24,32,26],[33,24,33,26],[20,15,21,15]]}
[]
[]
["Procuring Authority:",null,null,{"$f":"'Project Input'!D9","v":"East Ayrshire Council"},null,null,null,null,null,null,null,"WHOLE LIFE OUTCOMES - OPTION ANALYSIS DASHBOARD",null,null,null,null,null,null,null,null,null,null,null,null,"Date:",null,null,{"$f":"'Project Input'!G5","v":"2019-03-06"},null,null,null,null,null,null,null,null,null,null,"BASE"]
["Project Name:",null,null,{"$f":"'Project Input'!D11","v":"New Build"},null,null,null,null,null,null,null,null,null,null,null,null,null,null,null,null,null,null,null,"Revision:",null,null,null,{"$f":"'Project Input'!G6","v":"B"},null,null,null,null,null,null,null,null,null,null,"NPV"]
[null,null,null,null,null,null,null,null,null,null,null,null,null,null,null,null,null,null,null,null,null,null,null,"Selected Cost Basis:",null,null,null,null,null,null,"BASE"]
[]
{"$rows_left_out":61}
{"sheet":"WL Prefered","index":6,"n_rows":56,"n_cols":47,"rows_kept":56,"cut":false,"hidden":false,"merged":[[24,35,25,37],[26,35,27,37],[18,38,19,39],[18,40,19,41],[20,38,21,39],[20,40,21,41],[22,38,23,39],[22,40,23,41],[24,38,25,39],[24,40,25,41],[55,20,55,25],[53,3,53,4],[53,5,53,7],[53,8,53,10],[52,3,52,4],[52,5,52,7],[52,8,52,10],[55,3,55,4],[55,5,55,7],[55,8,55,10],[54,3,54,4],[54,5,54,7],[54,8,54,10],[53,20,53,25],[51,26,51,31],[28,20,28,22],[26,38,27,39],[26,40,27,41],[8,0,8,2],[15,38,15,39],[15,40,15,41],[15,42,15,43],[54,20,54,25],[25,20,25,22],[47,20,47,25],[47,26,47,31],[18,42,19,43],[20,42,21,43],[22,42,23,43],[24,42,25,43],[26,42,27,43],[16,42,17,43],[16,40,17,41],[16,35,17,37],[16,38,17,39],[18,35,19,37],[20,35,21,37],[22,35,23,37],[24,0,24,4],[30,26,30,28],[30,29,30,31],[31,23,31,25],[28,5,28,10],[48,20,48,25],[50,20,50,25],[51,20,51,25],[52,20,52,25],[24,23,24,25],[24,26,24,28],[24,29,24,31],[25,23,25,25],[25,26,25,28],[25,29,25,31],[27,23,27,25],[27,26,27,28],[27,29,27,31],[48,26,48,31],[49,20,49,25],[49,26,49,31],[28,29,28,31],[29,23,29,25],[29,26,29,28],[20,0,21,10],[20,11,21,19],[16,29,16,31],[17,23,17,25],[17,26,17,28],[17,29,17,31],[18,11,18,13],[16,15,17,15],[16,16,17,16],[16,17,17,17],[16,18,17,18],[16,19,17,19],[18,23,18,25],[16,11,17,13],[16,14,17,14],[16,0,19,10],[25,0,25,4],[37,0,37,4],[31,0,31,4],[31,5,31,10],[35,5,35,10],[27,0,27,4],[27,5,27,10],[28,0,28,4],[35,0,35,4],[36,0,36,4],[32,0,32,4],[29,0,29,4],[29,5,29,10],[30,0,30,4],[30,5,30,10],[2,0,2,2],[2,23,2,25],[2,26,2,28],[3,0,3,2],[3,22,3,25],[3,26,3,28],[4,26,4,28],[6,20,7,31],[4,21,4,25],[4,29,4,31],[2,12,3,21],[39,5,39,10],[40,5,40,10],[41,0,42,19],[36,5,36,10],[29,29,29,31],[41,20,42,31],[39,23,39,25],[50,26,50,31],[46,26,46,31],[46,20,46,25],[43,20,43,25],[43,26,43,31],[44,20,44,25],[44,26,44,31],[45,20,45,25],[45,26,45,31],[28,23,28,25],[28,26,28,28],[37,26,37,28],[35,23,35,25],[40,23,40,25],[30,23,30,25],[40,26,40,28],[40,29,40,31],[37,29,37,31],[38,23,38,25],[38,26,38,28],[38,29,38,31],[39,26,39,28],[39,29,39,31],[26,23,26,25],[26,26,26,28],[26,29,26,31],[24,5,24,10],[37,5,37,10],[38,5,38,10],[25,5,25,10],[33,21,34,31],[31,29,31,31],[32,23,32,25],[32,26,32,28],[32,29,32,31],[35,26,35,28],[35,29,35,31],[35,16,36,16],[31,26,31,28],[37,23,37,25],[36,23,36,25],[36,26,36,28],[36,29,36,31],[33,0,34,10],[32,5,32,10],[26,0,26,4],[26,5,26,10],[8,29,8,31],[9,23,9,25],[9,26,9,28],[22,23,22,25],[22,26,22,28],[22,29,22,31],[23,23,23,25],[23,26,23,28],[23,29,23,31],[14,29,14,31],[15,23,15,25],[15,26,15,28],[15,29,15,31],[19,29,19,31],[18,26,18,28],[18,29,18,31],[13,29,13,31],[14,23,14,25],[14,26,14,28],[14,18,15,18],[14,19,15,19],[8,11,13,19],[53,26,53,31],[54,26,54,31],[6,11,7,19],[6,0,7,10],[22,5,22,10],[22,0,22,4],[23,0,23,4],[23,5,23,10],[13,23,13,25],[13,26,13,28],[14,11,15,13],[14,14,15,14],[14,15,15,15],[16,23,16,25],[16,26,16,28],[19,23,19,25],[19,26,19,28],[20,20,21,31],[22,20,22,22],[8,23,8,25],[8,26,8,28],[55,26,55,31],[12,20,12,22],[8,3,8,10],[9,3,9,10],[10,3,10,10],[11,3,11,10],[12,3,12,10],[13,3,13,10],[14,3,14,10],[9,29,9,31],[10,23,10,25],[10,26,10,28],[10,29,10,31],[11,23,11,25],[11,26,11,28],[11,29,11,31],[12,23,12,25],[12,26,12,28],[12,29,12,31],[9,20,9,22],[22,14,23,17],[52,26,52,31],[14,16,15,16],[14,17,15,17]]}
[]
[]
["Procuring Authority:",null,null,{"$f":"'Project Input'!D9","v":"East Ayrshire Council"},null,null,null,null,null,null,null,null,"WHOLE LIFE OUTCOMES - PREFERED OPTION",null,null,null,null,null,null,null,null,null,null,"Date:",null,null,{"$f":"'Project Input'!G5","v":"2019-03-06"}]
["Project Name:",null,null,{"$f":"'Project Input'!D11","v":"New Build"},null,null,null,null,null,null,null,null,null,null,null,null,null,null,null,null,null,null,"Revision:",null,null,null,{"$f":"'Project Input'!G6","v":"B"}]
[null,null,null,null,null,null,null,null,null,null,null,null,null,null,null,null,null,null,null,null,null,"Select Preferred Option: ",null,null,null,null,"Option A",null,null,"Base"]
[]
{"$rows_left_out":51}
{"sheet":"Data","index":7,"n_rows":143,"n_cols":63,"rows_kept":143,"cut":false,"hidden":false,"merged":[]}
["OPTION DASHBOARD DATA & GRAPHS"]
["GRAPH & DIAGRAM DATA",null,null,null,null,null,null,null,null,null,null,null,null,null,null,null,null,null,null,null,null,null,null,null,null,null,null,null,null,null,null,null,null,null,null,null,null,null,null,null,null,null,null,null,null,null,null,null,null,null,null,null,null,null,null,null,null,null,null,null,null,null,2010]
[null,null,null,null,null,null,null,null,null,null,null,null,null,null,null,null,null,null,null,null,null,null,null,null,null,null,null,null,null,null,null,null,null,null,null,null,null,null,null,null,null,null,null,null,null,null,null,null,null,null,null,null,null,null,null,null,null,null,null,null,null,null,2011]
["Cumulative Cashflow BASE COSTS",null,null,null,null,null,null,null,null,null,null,null,null,null,null,null,null,null,null,null,null,null,null,null,null,null,null,null,null,null,null,null,null,null,null,null,null,null,null,null,null,null,null,null,null,null,null,null,null,null,null,null,null,null,null,null,null,null,null,null,null,null,2012]
[null,1,2,3,4,5,6,7,8,9,10,11,12,13,14,15,16,17,18,19,20,21,22,23,24,25,26,27,28,29,30,31,32,33,34,35,36,37,38,39,40,41,42,43,44,45,46,47,48,49,50,51,52,53,54,55,56,57,58,59,60,null,2013]
["Option A",{"$f":"'Option A'!I23","v":762367},{"$f":"'Option A'!J23","v":1599669},{"$f":"'Option A'!K23","v":1648976},{"$f":"'Option A'!L23","v":1700428.72},{"$f":"'Option A'!M23","v":1751881.44},{"$f":"'Option A'!N23","v":1803334.16},{"$f":"'Option A'!O23","v":1860966.88},{"$f":"'Option A'!P23","v":1933299.88},{"$f":"'Option A'!Q23","v":1988472.5999999999},{"$f":"'Option A'!R23","v":2042205.3199999998},{"$f":"'Option A'!S23","v":2132204.44},{"$f":"'Option A'!T23","v":2227589.16},{"$f":"'Option A'!U23","v":2295826.2800000003},{"$f":"'Option A'!V23","v":2415309.4000000004},{"$f":"'Option A'!W23","v":2483546.5200000005},{"$f":"'Option A'!X23","v":2553223.6400000006},{"$f":"'Option A'!Y23","v":2655725.5600000005},{"$f":"'Option A'!Z23","v":2731079.8800000004},{"$f":"'Option A'!AA23","v":2806434.2},{"$f":"'Option A'!AB23","v":3001222.12},{"$f":"'Option A'!AC23","v":3076576.44},{"$f":"'Option A'!AD23","v":3260728.76},{"$f":"'Option A'!AE23","v":3338123.0799999996},{"$f":"'Option A'!AF23","v":3414077.3999999994},{"$f":"'Option A'!AG23","v":3490031.7199999993},{"$f":"'Option A'!AH23","v":3619172.4399999995},{"$f":"'Option A'!AI23","v":3722274.3599999994},{"$f":"'Option A'!AJ23","v":3798228.6799999992},{"$f":"'Option A'!AK23","v":3978678.9999999991},{"$f":"'Option A'!AL23","v":4056073.3199999989},{"$f":"'Option A'!AM23","v":4132027.6399999987},{"$f":"'Option A'!AN23","v":4253129.5599999987},{"$f":"'Option A'!AO23","v":4329683.879999999},{"$f":"'Option A'!AP23","v":4406238.1999999993},{"$f":"'Option A'!AQ23","v":4482792.5199999996},{"$f":"'Option A'!AR23","v":4559346.84},{"$f":"'Option A'!AS23","v":4664488.76},{"$f":"'Option A'!AT23","v":4915674.2799999993},{"$f":"'Option A'!AU23","v":4992228.5999999996},{"$f":"'Option A'!AV23","v":5068782.92},{"$f":"'Option A'!AW23","v":5145337.24},{"$f":"'Option A'!AX23","v":5677851.96},{"$f":"'Option A'!AY23","v":5754406.2800000003},{"$f":"'Option A'!AZ23","v":5849800.6000000006},{"$f":"'Option A'!BA23","v":5926354.9200000009},{"$f":"'Option A'!BB23","v":6002909.2400000012},{"$f":"'Option A'!BC23","v":6142877.5600000015},{"$f":"'Option A'!BD23","v":6219431.8800000018},{"$f":"'Option A'!BE23","v":6295986.200000002},{"$f":"'Option A'!BF23","v":6422382.5200000023},{"$f":"'Option A'!BG23","v":6500376.8400000026},{"$f":"'Option A'!BH23","v":6587994.7600000026},{"$f":"'Option A'!BI23","v":6589132.5200000023},{"$f":"'Option A'!BJ23","v":6589132.5200000023},{"$f":"'Option A'!BK23","v":6589132.5200000023},{"$f":"'Option A'!BL23","v":6589132.5200000023},{"$f":"'Option A'!BM23","v":6589132.5200000023},{"$f":"'Option A'!BN23","v":6589132.5200000023},{"$f":"'Option A'!BO23","v":6589132.5200000023},{"$f":"'Option A'!BP23","v":6589132.5200000023},null,2014]
{"$rows_left_out":137}