{"text_format":"1","workbook":"xlsx","n_sheets":9,"sheets":["Read Me","Import avoidance model - RR","Definition","IRR and ROI","PV data","Data","PV Generation factor calcs","Sheet2","LOGIC"],"not_rendered":{"charts":8,"images":10,"macros":1,"external_links":0,"defined_names":40,"comments":2,"pivot_tables":0},"unopened":[],"bounds":{"document_bytes":16777216,"sheet_cells":100000,"rows_first":2000,"rows_last":500,"rows_between":2000,"halvings":0,"cell_chars":16384,"cell_head_chars":4096},"cells_cut":0,"cells_raw":0,"read":"whole","date_system":"1900"}

{"sheet":"Read Me","index":0,"n_rows":2,"n_cols":1,"rows_kept":2,"cut":false,"hidden":false,"merged":[]}
[]
["Onsite solar PV: Ready Reckoner for Import Avoidance"]

{"sheet":"Import avoidance model - RR","index":1,"n_rows":155,"n_cols":15,"rows_kept":155,"cut":false,"hidden":false,"merged":[[100,2,101,2],[34,8,35,8],[39,8,39,13],[39,2,39,6],[43,7,43,9],[44,7,44,9],[46,2,46,3],[47,2,47,3],[45,7,45,9],[46,8,46,10],[42,12,42,14],[43,12,43,14],[34,6,35,7],[43,3,43,5],[42,7,42,9],[41,12,41,14],[40,8,40,9],[41,7,41,9],[17,2,19,2],[18,5,18,6],[25,2,26,2],[3,2,3,13],[26,9,26,11],[19,5,19,6],[22,9,22,13],[33,6,33,7],[32,6,32,7],[25,9,25,12],[21,5,21,7],[22,2,22,3],[27,9,27,12],[27,5,28,7],[11,11,11,13],[11,5,11,9],[11,2,11,3],[24,9,24,12]]}
[]
[]
[]
[null,null,"Onsite solar PV: battery storage ready reckoner for import avoidance"]
[]
[null,null,"Instructions"]
[]
[null,null,null,null,null,"Green cells must be filled in",null,null,null,null,null,"Blue cells are optional"]
{"$rows_left_out":148}
{"sheet":"Definition","index":2,"n_rows":2,"n_cols":1,"rows_kept":2,"cut":false,"hidden":false,"merged":[]}
[]
["Definitions"]

{"sheet":"IRR and ROI","index":3,"n_rows":36,"n_cols":29,"rows_kept":36,"cut":false,"hidden":true,"merged":[]}
[]
["Battery lifetime",{"$f":"'Import avoidance model - RR'!N19","v":10},null,null,1,2,3,4,5,6,7,8,9,10,11,12,13,14,15,16,17,18,19,20,21,22,23,24,25]
[]
[null,null,null,"Year0 ","Year1","Year2","Year3","Year4","Year5","Year6","Year7","Year8","Year9","Year10","Year11","Year12","Year13","Year14","Year15","Year16","Year17","Year18","Year19","Year20","Year21","Year22","Year23","Year24","Year25"]
[null,"Battery Capex",null,{"$f":"-Data!F76","v":-11246.690799587139}]
[null,"Battery O&M",{"$f":"'Import avoidance model - RR'!N18","v":0.02},null,{"$f":"IF(E2<=$B$2,$D$5*$C$6,\"\")","v":-224.93381599174279},{"$f":"IF(F2<=$B$2,$D$5*$C$6,\"\")","v":-224.93381599174279},-224.93381599174279,-224.93381599174279,-224.93381599174279,-224.93381599174279,-224.93381599174279,-224.93381599174279,-224.93381599174279,-224.93381599174279,"","","","","","","","","","","","","","",""]
[null,"Cost of finance",{"$f":"IF('Import avoidance model - RR'!I22=\"Y\",'Import avoidance model - RR'!N25,\"\")","v":0.05},null,{"$f":"IFERROR(IF(E2='Import avoidance model - RR'!$N$26,'IRR and ROI'!$D$5,IF('IRR and ROI'!E2>'Import avoidance model - RR'!$N$26,\"\",$C$7*$D$5)),0)","v":-562.33453997935692},{"$f":"IFERROR(IF(F2='Import avoidance model - RR'!$N$26,'IRR and ROI'!$D$5,IF('IRR and ROI'!F2>'Import avoidance model - RR'!$N$26,\"\",$C$7*$D$5)),0)","v":-562.33453997935692},{"$f":"IFERROR(IF(G2='Import avoidance model - RR'!$N$26,'IRR and ROI'!$D$5,IF('IRR and ROI'!G2>'Import avoidance model - RR'!$N$26,\"\",$C$7*$D$5)),0)","v":-562.33453997935692},{"$f":"IFERROR(IF(H2='Import avoidance model - RR'!$N$26,'IRR and ROI'!$D$5,IF('IRR and ROI'!H2>'Import avoidance model - RR'!$N$26,\"\",$C$7*$D$5)),0)","v":-562.33453997935692},{"$f":"IFERROR(IF(I2='Import avoidance model - RR'!$N$26,'IRR and ROI'!$D$5,IF('IRR and ROI'!I2>'Import avoidance model - RR'!$N$26,\"\",$C$7*$D$5)),0)","v":-562.33453997935692},{"$f":"IFERROR(IF(J2='Import avoidance model - RR'!$N$26,'IRR and ROI'!$D$5,IF('IRR and ROI'!J2>'Import avoidance model - RR'!$N$26,\"\",$C$7*$D$5)),0)","v":-562.33453997935692},{"$f":"IFERROR(IF(K2='Import avoidance model - RR'!$N$26,'IRR and ROI'!$D$5,IF('IRR and ROI'!K2>'Import avoidance model - RR'!$N$26,\"\",$C$7*$D$5)),0)","v":-562.33453997935692},{"$f":"IFERROR(IF(L2='Import avoidance model - RR'!$N$26,'IRR and ROI'!$D$5,IF('IRR and ROI'!L2>'Import avoidance model - RR'!$N$26,\"\",$C$7*$D$5)),0)","v":-562.33453997935692},{"$f":"IFERROR(IF(M2='Import avoidance model - RR'!$N$26,'IRR and ROI'!$D$5,IF('IRR and ROI'!M2>'Import avoidance model - RR'!$N$26,\"\",$C$7*$D$5)),0)","v":-562.33453997935692},{"$f":"IFERROR(IF(N2='Import avoidance model - RR'!$N$26,'IRR and ROI'!$D$5,IF('IRR and ROI'!N2>'Import avoidance model - RR'!$N$26,\"\",$C$7*$D$5)),0)","v":-11246.690799587139},{"$f":"IFERROR(IF(O2='Import avoidance model - RR'!$N$26,'IRR and ROI'!$D$5,IF('IRR and ROI'!O2>'Import avoidance model - RR'!$N$26,\"\",$C$7*$D$5)),0)","v":""},{"$f":"IFERROR(IF(P2='Import avoidance model - RR'!$N$26,'IRR and ROI'!$D$5,IF('IRR and ROI'!P2>'Import avoidance model - RR'!$N$26,\"\",$C$7*$D$5)),0)","v":""},{"$f":"IFERROR(IF(Q2='Import avoidance model - RR'!$N$26,'IRR and ROI'!$D$5,IF('IRR and ROI'!Q2>'Import avoidance model - RR'!$N$26,\"\",$C$7*$D$5)),0)","v":""},{"$f":"IFERROR(IF(R2='Import avoidance model - RR'!$N$26,'IRR and ROI'!$D$5,IF('IRR and ROI'!R2>'Import avoidance model - RR'!$N$26,\"\",$C$7*$D$5)),0)","v":""},{"$f":"IFERROR(IF(S2='Import avoidance model - RR'!$N$26,'IRR and ROI'!$D$5,IF('IRR and ROI'!S2>'Import avoidance model - RR'!$N$26,\"\",$C$7*$D$5)),0)","v":""},{"$f":"IFERROR(IF(T2='Import avoidance model - RR'!$N$26,'IRR and ROI'!$D$5,IF('IRR and ROI'!T2>'Import avoidance model - RR'!$N$26,\"\",$C$7*$D$5)),0)","v":""},{"$f":"IFERROR(IF(U2='Import avoidance model - RR'!$N$26,'IRR and ROI'!$D$5,IF('IRR and ROI'!U2>'Import avoidance model - RR'!$N$26,\"\",$C$7*$D$5)),0)","v":""},{"$f":"IFERROR(IF(V2='Import avoidance model - RR'!$N$26,'IRR and ROI'!$D$5,IF('IRR and ROI'!V2>'Import avoidance model - RR'!$N$26,\"\",$C$7*$D$5)),0)","v":""},{"$f":"IFERROR(IF(W2='Import avoidance model - RR'!$N$26,'IRR and ROI'!$D$5,IF('IRR and ROI'!W2>'Import avoidance model - RR'!$N$26,\"\",$C$7*$D$5)),0)","v":""},{"$f":"IFERROR(IF(X2='Import avoidance model - RR'!$N$26,'IRR and ROI'!$D$5,IF('IRR and ROI'!X2>'Import avoidance model - RR'!$N$26,\"\",$C$7*$D$5)),0)","v":""},{"$f":"IFERROR(IF(Y2='Import avoidance model - RR'!$N$26,'IRR and ROI'!$D$5,IF('IRR and ROI'!Y2>'Import avoidance model - RR'!$N$26,\"\",$C$7*$D$5)),0)","v":""},{"$f":"IFERROR(IF(Z2='Import avoidance model - RR'!$N$26,'IRR and ROI'!$D$5,IF('IRR and ROI'!Z2>'Import avoidance model - RR'!$N$26,\"\",$C$7*$D$5)),0)","v":""},{"$f":"IFERROR(IF(AA2='Import avoidance model - RR'!$N$26,'IRR and ROI'!$D$5,IF('IRR and ROI'!AA2>'Import avoidance model - RR'!$N$26,\"\",$C$7*$D$5)),0)","v":""},{"$f":"IFERROR(IF(AB2='Import avoidance model - RR'!$N$26,'IRR and ROI'!$D$5,IF('IRR and ROI'!AB2>'Import avoidance model - RR'!$N$26,\"\",$C$7*$D$5)),0)","v":""},{"$f":"IFERROR(IF(AC2='Import avoidance model - RR'!$N$26,'IRR and ROI'!$D$5,IF('IRR and ROI'!AC2>'Import avoidance model - RR'!$N$26,\"\",$C$7*$D$5)),0)","v":""}]
[null,"Project development costs",{"$f":"'Import avoidance model - RR'!N20","v":0.06},{"$f":"C8*D5","v":-674.80144797522826}]
{"$rows_left_out":29}
{"sheet":"PV data","index":4,"n_rows":52,"n_cols":10,"rows_kept":52,"cut":false,"hidden":true,"merged":[[2,2,2,8],[4,0,7,1]]}
["PV array generation data: Ready reckoner"]
[]
["PV array size (kW)",{"$f":"'Import avoidance model - RR'!H14","v":200},"PV average generation (kWh)"]
[null,null,"Winter Factor","Winter generation","Summer Factor","Summer generation","Autumn Factor","Autumn generation","Spring Factor","Spring generation"]
["Factors are based on the Regen PV model, for a typical days' generation in the south west",null,{"$error":"#DIV/0!"},{"$f":"IFERROR($B$3/C5,0)","v":0},{"$error":"#DIV/0!"},{"$f":"IFERROR($B$3/E5,0)","v":0},{"$error":"#DIV/0!"},{"$f":"IFERROR($B$3/G5,0)","v":0},{"$error":"#DIV/0!"},{"$f":"IFERROR($B$3/I5,0)","v":0}]
[null,null,{"$error":"#DIV/0!"},{"$f":"IFERROR($B$3/C6,0)","v":0},{"$error":"#DIV/0!"},{"$f":"IFERROR($B$3/E6,0)","v":0},{"$error":"#DIV/0!"},{"$f":"IFERROR($B$3/G6,0)","v":0},{"$error":"#DIV/0!"},{"$f":"IFERROR($B$3/I6,0)","v":0}]
[null,null,{"$error":"#DIV/0!"},0,{"$error":"#DIV/0!"},0,{"$error":"#DIV/0!"},0,{"$error":"#DIV/0!"},0]
[null,null,{"$error":"#DIV/0!"},0,{"$error":"#DIV/0!"},0,{"$error":"#DIV/0!"},0,{"$error":"#DIV/0!"},0]
{"$rows_left_out":45}
{"sheet":"Data","index":5,"n_rows":76,"n_cols":23,"rows_kept":76,"cut":false,"hidden":true,"merged":[[0,3,0,6],[0,7,0,10],[0,11,0,14],[0,15,0,18],[1,21,2,22]]}
["Category","% of 'non-use' to 'use' daily demand",null,"Secondary school",null,null,null,"Primary school",null,null,null,"Retail (Elexon profile class 3)",null,null,null,"Leisure centre",null,null,null,null,null,"Selected demand profile",{"$f":"'Import avoidance model - RR'!$D$17","v":"Secondary school"}]
["Primary school",0.4,null,"% of 'Use' per year",null,"% of 'non-use' per year",null,"% of 'Use' per year",null,"% of 'non-use' per year",null,"% of 'Use' per year",null,"% of 'non-use' per year",null,"% of 'Use' per year",null,"% of 'non-use' per year",null,null,null,"DASHBOARD CHART"]
["Secondary school",{"$f":"0.56","v":0.56000000000000005},null,{"$f":"'Import avoidance model - RR'!D15/365","v":0.53424657534246578},null,{"$f":"'Import avoidance model - RR'!D16/365","v":0.46575342465753422},null,{"$f":"D3","v":0.53424657534246578},null,{"$f":"F3","v":0.46575342465753422},null,{"$f":"H3","v":0.53424657534246578},null,{"$f":"J3","v":0.46575342465753422},null,{"$f":"L3","v":0.53424657534246578},null,{"$f":"N3","v":0.46575342465753422}]
["Leisure centre",null,null,"average daily consumption (kWh)",null,"average daily consumption (kWh)",null,"average daily consumption (kWh)",null,"average daily consumption (kWh)",null,"average daily consumption (kWh)",null,"average daily consumption (kWh)",null,"average daily consumption (kWh)",null,"average daily consumption (kWh)",null,null,null,"Use' per year"," 'non-use' per year"]
["Retail",null,null,{"$f":"(B8/('Import avoidance model - RR'!D15+'Import avoidance model - RR'!D16*Data!B6))","v":1712.9153819801304},"HH consumption",{"$f":"B6*D5","v":976.36176772867441},"HH consumption",{"$f":"D5","v":1712.9153819801304},"HH consumption",{"$f":"F5","v":976.36176772867441},"HH consumption",{"$f":"H5","v":1712.9153819801304},"HH consumption",{"$f":"J5","v":976.36176772867441},"HH consumption",{"$f":"L5","v":1712.9153819801304},"HH consumption",{"$f":"N5","v":976.36176772867441},"HH consumption",null,null,"HH consumption","HH consumption"]
["Value used in modelling",{"$f":"'Import avoidance model - RR'!F26","v":0.57000000000000006},"00:00:00",1.0280832260674064E-2,{"$f":"D6*$D$5","v":17.610195718866162},2.0795667857544484E-2,{"$f":"F6*$F$5","v":20.304095030490508},null,{"$f":"H6*$H$5","v":0},1.4074378467228272E-2,{"$f":"J6*$J$5","v":13.741685039945386},8.0543352017371124E-3,{"$f":"L6*$L$5","v":13.796394658679537},1.4074378467228272E-2,{"$f":"N6*$N$5","v":13.741685039945386},null,{"$f":"P6*$P$5","v":0},null,{"$f":"R6*$R$5","v":0},null,null,{"$f":"IF($W$1=\"Retail\",M6,IF($W$1=\"Leisure Centre\",Q6,IF($W$1=\"Primary School\",I6,IF($W$1=\"Secondary School\",E6,\"\"))))","v":17.610195718866162},{"$f":"IF($W$1=\"Retail\",O6,IF($W$1=\"Leisure Centre\",S6,IF($W$1=\"Primary School\",K6,IF($W$1=\"Secondary School\",G6,\"\"))))","v":20.304095030490508}]
["Location","Total demand","00:30:00",1.0247062509907026E-2,{"$f":"D7*$D$5","v":17.552350993331668},2.0776154064813552E-2,{"$f":"F7*$F$5","v":20.285042509324644},null,{"$f":"H7*$H$5","v":0},1.366344770906102E-2,{"$f":"J7*$J$5","v":13.340467958487125},7.8775943038933496E-3,{"$f":"L7*$L$5","v":13.493652456137976},1.366344770906102E-2,{"$f":"N7*$N$5","v":13.340467958487125},null,{"$f":"P7*$P$5","v":0},null,{"$f":"R7*$R$5","v":0},null,null,{"$f":"IF($W$1=\"Retail\",M7,IF($W$1=\"Leisure Centre\",Q7,IF($W$1=\"Primary School\",I7,IF($W$1=\"Secondary School\",E7,\"\"))))","v":17.552350993331668},{"$f":"IF($W$1=\"Retail\",O7,IF($W$1=\"Leisure Centre\",S7,IF($W$1=\"Primary School\",K7,IF($W$1=\"Secondary School\",G7,\"\"))))","v":20.285042509324644}]
["South west",{"$f":"'Import avoidance model - RR'!D14+'Import avoidance model - RR'!D28","v":500000},"01:00:00",1.0211545895626806E-2,17.491514038415222,2.08962544180132E-2,20.402303902479492,null,0,1.3432299157591945E-2,13.114783350166855,7.8018482048174513E-3,13.363905797905879,1.3432299157591945E-2,13.114783350166855,null,0,null,0,null,null,17.491514038415222,20.402303902479492]
{"$rows_left_out":69}
{"sheet":"PV Generation factor calcs","index":6,"n_rows":51,"n_cols":21,"rows_kept":51,"cut":false,"hidden":true,"merged":[]}
["SUMMER",null,145,47.84,null,null,null,"AUTUMN",null,145,47.84,null,null,null,"SPRING",null,145,47.84]
["145kW","47.84kW","kWh","kWh","Factor 1","Factor 2","Average","145kW","47.84kW","kWh","kWh","Factor 1","Factor 2","Average","145kW","47.84kW","kWh","kWh","Factor 1","Factor 2","Average"]
["Output kW",null,null,null,null,null,null,"Output kW",null,null,null,null,null,null,"Output kW"]
[0,0,{"$f":"A4*0.5","v":0},{"$f":"B4*0.5","v":0},{"$f":"$C$1/C4","v":{"$error":"#DIV/0!"}},{"$f":"$D$1/D4","v":{"$error":"#DIV/0!"}},{"$f":"AVERAGE(E4:F4)","v":{"$error":"#DIV/0!"}},0,0,{"$f":"H4*0.5","v":0},{"$f":"0.5*I4","v":0},{"$f":"$J$1/J4","v":{"$error":"#DIV/0!"}},{"$f":"$K$1/K4","v":{"$error":"#DIV/0!"}},{"$f":"AVERAGE(L4:M4)","v":{"$error":"#DIV/0!"}},0,0,{"$f":"0.5*O4","v":0},{"$f":"P4*0.5","v":0},{"$f":"$Q$1/Q4","v":{"$error":"#DIV/0!"}},{"$f":"$R$1/R4","v":{"$error":"#DIV/0!"}},{"$f":"AVERAGE(S4:T4)","v":{"$error":"#DIV/0!"}}]
[0,0,{"$f":"A5*0.5","v":0},{"$f":"B5*0.5","v":0},{"$f":"$C$1/C5","v":{"$error":"#DIV/0!"}},{"$f":"$D$1/D5","v":{"$error":"#DIV/0!"}},{"$f":"AVERAGE(E5:F5)","v":{"$error":"#DIV/0!"}},0,0,{"$f":"H5*0.5","v":0},{"$f":"0.5*I5","v":0},{"$f":"$J$1/J5","v":{"$error":"#DIV/0!"}},{"$f":"$K$1/K5","v":{"$error":"#DIV/0!"}},{"$f":"AVERAGE(L5:M5)","v":{"$error":"#DIV/0!"}},0,0,{"$f":"0.5*O5","v":0},{"$f":"P5*0.5","v":0},{"$f":"$Q$1/Q5","v":{"$error":"#DIV/0!"}},{"$f":"$R$1/R5","v":{"$error":"#DIV/0!"}},{"$f":"AVERAGE(S5:T5)","v":{"$error":"#DIV/0!"}}]
[0,0,0,0,{"$error":"#DIV/0!"},{"$error":"#DIV/0!"},{"$error":"#DIV/0!"},0,0,0,0,{"$error":"#DIV/0!"},{"$error":"#DIV/0!"},{"$error":"#DIV/0!"},0,0,0,0,{"$error":"#DIV/0!"},{"$error":"#DIV/0!"},{"$error":"#DIV/0!"}]
[0,0,0,0,{"$error":"#DIV/0!"},{"$error":"#DIV/0!"},{"$error":"#DIV/0!"},0,0,0,0,{"$error":"#DIV/0!"},{"$error":"#DIV/0!"},{"$error":"#DIV/0!"},0,0,0,0,{"$error":"#DIV/0!"},{"$error":"#DIV/0!"},{"$error":"#DIV/0!"}]
[0,0,0,0,{"$error":"#DIV/0!"},{"$error":"#DIV/0!"},{"$error":"#DIV/0!"},0,0,0,0,{"$error":"#DIV/0!"},{"$error":"#DIV/0!"},{"$error":"#DIV/0!"},0,0,0,0,{"$error":"#DIV/0!"},{"$error":"#DIV/0!"},{"$error":"#DIV/0!"}]
{"$rows_left_out":44}
{"sheet":"Sheet2","index":7,"n_rows":50,"n_cols":29,"rows_kept":50,"cut":false,"hidden":true,"merged":[[0,1,0,4],[0,8,0,11],[0,15,0,18],[0,22,0,25]]}
[null,"Jan",null,null,null,null,null,null,"April",null,null,null,null,null,null,"July",null,null,null,null,null,null,"Oct"]
[null,47,"145kW","kWH","kWh","Factoe 1","Foactor 2","Average","47kW","145kW","kWH","kWh","Factoe 1","Foactor 2","Average","47kW","145kW","kWH","kWh","Factoe 1","Foactor 2","Average","47kW","145kW","kWH","kWh","Factoe 1","Foactor 2","Average"]
[null,0,0,{"$f":"0.5*B3","v":0},{"$f":"0.5*C3","v":0},{"$f":"$B$2/D3","v":{"$error":"#DIV/0!"}},{"$f":"$B$2/E3","v":{"$error":"#DIV/0!"}},{"$f":"AVERAGE(F3:G3)","v":{"$error":"#DIV/0!"}},0,0,{"$f":"0.5*I3","v":0},{"$f":"0.5*J3","v":0},{"$f":"$B$2/K3","v":{"$error":"#DIV/0!"}},{"$f":"$B$2/L3","v":{"$error":"#DIV/0!"}},{"$f":"AVERAGE(M3:N3)","v":{"$error":"#DIV/0!"}},0,0,{"$f":"0.5*P3","v":0},{"$f":"0.5*Q3","v":0},{"$f":"$B$2/R3","v":{"$error":"#DIV/0!"}},{"$f":"$B$2/S3","v":{"$error":"#DIV/0!"}},{"$f":"AVERAGE(T3:U3)","v":{"$error":"#DIV/0!"}},0,0,{"$f":"0.5*W3","v":0},{"$f":"0.5*X3","v":0},{"$f":"$B$2/Y3","v":{"$error":"#DIV/0!"}},{"$f":"$B$2/Z3","v":{"$error":"#DIV/0!"}},{"$f":"AVERAGE(AA3:AB3)","v":{"$error":"#DIV/0!"}}]
[null,0,0,{"$f":"0.5*B4","v":0},{"$f":"0.5*C4","v":0},{"$f":"$B$2/D4","v":{"$error":"#DIV/0!"}},{"$f":"$B$2/E4","v":{"$error":"#DIV/0!"}},{"$f":"AVERAGE(F4:G4)","v":{"$error":"#DIV/0!"}},0,0,{"$f":"0.5*I4","v":0},{"$f":"0.5*J4","v":0},{"$f":"$B$2/K4","v":{"$error":"#DIV/0!"}},{"$f":"$B$2/L4","v":{"$error":"#DIV/0!"}},{"$f":"AVERAGE(M4:N4)","v":{"$error":"#DIV/0!"}},0,0,{"$f":"0.5*P4","v":0},{"$f":"0.5*Q4","v":0},{"$f":"$B$2/R4","v":{"$error":"#DIV/0!"}},{"$f":"$B$2/S4","v":{"$error":"#DIV/0!"}},{"$f":"AVERAGE(T4:U4)","v":{"$error":"#DIV/0!"}},0,0,{"$f":"0.5*W4","v":0},{"$f":"0.5*X4","v":0},{"$f":"$B$2/Y4","v":{"$error":"#DIV/0!"}},{"$f":"$B$2/Z4","v":{"$error":"#DIV/0!"}},{"$f":"AVERAGE(AA4:AB4)","v":{"$error":"#DIV/0!"}}]
[null,0,0,0,0,{"$error":"#DIV/0!"},{"$error":"#DIV/0!"},{"$error":"#DIV/0!"},0,0,0,0,{"$error":"#DIV/0!"},{"$error":"#DIV/0!"},{"$error":"#DIV/0!"},0,0,0,0,{"$error":"#DIV/0!"},{"$error":"#DIV/0!"},{"$error":"#DIV/0!"},0,0,0,0,{"$error":"#DIV/0!"},{"$error":"#DIV/0!"},{"$error":"#DIV/0!"}]
[null,0,0,0,0,{"$error":"#DIV/0!"},{"$error":"#DIV/0!"},{"$error":"#DIV/0!"},0,0,0,0,{"$error":"#DIV/0!"},{"$error":"#DIV/0!"},{"$error":"#DIV/0!"},0,0,0,0,{"$error":"#DIV/0!"},{"$error":"#DIV/0!"},{"$error":"#DIV/0!"},0,0,0,0,{"$error":"#DIV/0!"},{"$error":"#DIV/0!"},{"$error":"#DIV/0!"}]
[null,0,0,0,0,{"$error":"#DIV/0!"},{"$error":"#DIV/0!"},{"$error":"#DIV/0!"},0,0,0,0,{"$error":"#DIV/0!"},{"$error":"#DIV/0!"},{"$error":"#DIV/0!"},0,0,0,0,{"$error":"#DIV/0!"},{"$error":"#DIV/0!"},{"$error":"#DIV/0!"},0,0,0,0,{"$error":"#DIV/0!"},{"$error":"#DIV/0!"},{"$error":"#DIV/0!"}]
[null,0,0,0,0,{"$error":"#DIV/0!"},{"$error":"#DIV/0!"},{"$error":"#DIV/0!"},0,0,0,0,{"$error":"#DIV/0!"},{"$error":"#DIV/0!"},{"$error":"#DIV/0!"},0,0,0,0,{"$error":"#DIV/0!"},{"$error":"#DIV/0!"},{"$error":"#DIV/0!"},0,0,0,0,{"$error":"#DIV/0!"},{"$error":"#DIV/0!"},{"$error":"#DIV/0!"}]
{"$rows_left_out":43}
{"sheet":"LOGIC","index":8,"n_rows":208,"n_cols":66,"rows_kept":208,"cut":false,"hidden":true,"merged":[[54,54,54,58],[54,60,54,65],[157,2,157,15],[158,3,158,8],[158,10,158,15],[54,30,54,33],[54,34,54,37],[54,38,54,41],[54,42,54,46],[54,48,54,52],[53,2,53,15],[54,3,54,8],[54,10,54,15],[105,2,105,15],[106,3,106,8],[106,10,106,15],[2,3,2,8],[2,10,2,15],[1,2,1,15],[1,18,1,21],[1,23,1,26],[0,18,0,26],[54,18,54,19],[54,20,54,21],[54,22,54,23],[54,24,54,25],[53,18,53,25],[54,26,54,29]]}
[null,null,null,null,null,null,null,null,null,null,null,null,null,null,null,null,null,null,"Summary of energy balance"]
["Min charge (kWh)",null,"Winter",null,null,null,null,null,null,null,null,null,null,null,null,null,null,null,"In use day",null,null,null,null,"Not in use day"]
[{"$f":"'Import avoidance model - RR'!N17","v":12},null,null,"Use' day logic",null,null,null,null,null,null,"Non Use' day logic",null,null,null,null,null,null,{"$f":"'Import avoidance model - RR'!D101","v":"Autumn"},"Demand","Generation","Import","Battery discharge","Battery status","Demand","Generation","Import","Battery Discharge","Battery status"]
["Max charge (kWh)",null,"Generation (kWh)","Use' Demand (kWh)","Available to charge battery (kWh)","Battery Recharge / kWh","Battery Discharge / kWh","Discharge/Recharge / kWh","Battery charge","Generation (kWh)","Use' Demand (kWh)","Available to charge battery (kWh)","Battery Recharge / kWh","Battery Discharge / kWh","Discharge/Recharge / kWh","Battery charge",null,"00:00:00",{"$f":"D5","v":17.610195718866162},{"$f":"IF($R$3=\"Spring\",C57,IF($R$3=\"Summer\",C109,IF($R$3=\"Autumn\",C161,IF($R$3=\"Winter\",C5,\"\"))))","v":0},{"$f":"IF(T4>=S4,0,IF(S4-T4-V4<0,0,S4-T4-V4))","v":17.610195718866162},{"$f":"IF($R$3=\"Spring\",G57,IF($R$3=\"Summer\",G109,IF($R$3=\"Autumn\",G161,IF($R$3=\"Winter\",H5,\"\"))))","v":0},{"$f":"IF($R$3=\"Spring\",I57,IF($R$3=\"Summer\",I109,IF($R$3=\"Autumn\",I161,IF($R$3=\"Winter\",I5,\"\"))))","v":12},{"$f":"K5","v":20.304095030490508},{"$f":"T4","v":0},{"$f":"IF(Y4>=X4,0,IF(X4-Y4-AA4<0,0,X4-Y4-AA4))","v":20.304095030490508},{"$f":"IF($R$3=\"Spring\",N57,IF($R$3=\"Summer\",N109,IF($R$3=\"Autumn\",N161,IF($R$3=\"Winter\",N5,\"\"))))","v":0},{"$f":"IF($R$3=\"Spring\",P57,IF($R$3=\"Summer\",P109,IF($R$3=\"Autumn\",P161,IF($R$3=\"Winter\",P5,\"\"))))","v":12}]
[{"$f":"'Import avoidance model - RR'!N14*'Import avoidance model - RR'!N15","v":60},"00:00:00",{"$f":"'PV data'!D5","v":0},{"$f":"IF($A$10=\"Secondary School\",Data!E6,IF($A$10=\"Primary school\",Data!I6,IF($A$10=\"Retail\",Data!M6,IF($A$10=\"Leisure Centre\",Data!Q6,\"\"))))","v":17.610195718866162},{"$f":"IF(C5>D5,(C5-D5),0)","v":0},{"$f":"IF(($A$3+E5)<$A$5,E5,$A$5)","v":0},{"$f":"IF(AND(D5>C5,I5>'Import avoidance model - RR'!$N$17,I5),D5-C5,0)","v":0},{"$f":"F5-G5","v":0},{"$f":"A3","v":12},{"$f":"C5","v":0},{"$f":"IF($A$10=\"Secondary School\",Data!G6,IF($A$10=\"Primary school\",Data!K6,IF($A$10=\"Retail\",Data!O6,IF($A$10=\"Leisure Centre\",Data!S6,\"\"))))","v":20.304095030490508},{"$f":"IF(J5>K5,(J5-K5),0)","v":0},{"$f":"IF(($A$3+L5)<$A$5,E5,$A$5)","v":0},{"$f":"IF(AND(K5>J5,P5>'Import avoidance model - RR'!$N$17,P5),K5-J5,0)","v":0},{"$f":"M5-N5","v":0},{"$f":"A3","v":12},null,"00:30:00",{"$f":"D6","v":17.552350993331668},{"$f":"IF($R$3=\"Spring\",C58,IF($R$3=\"Summer\",C110,IF($R$3=\"Autumn\",C162,IF($R$3=\"Winter\",C6,\"\"))))","v":0},{"$f":"IF(T5>=S5,0,IF(S5-T5-V5<0,0,S5-T5-V5))","v":17.552350993331668},{"$f":"IF($R$3=\"Spring\",G58,IF($R$3=\"Summer\",G110,IF($R$3=\"Autumn\",G162,IF($R$3=\"Winter\",H6,\"\"))))","v":0},{"$f":"IF($R$3=\"Spring\",I58,IF($R$3=\"Summer\",I110,IF($R$3=\"Autumn\",I162,IF($R$3=\"Winter\",I6,\"\"))))","v":12},{"$f":"K6","v":20.285042509324644},{"$f":"T5","v":0},{"$f":"IF(Y5>=X5,0,IF(X5-Y5-AA5<0,0,X5-Y5-AA5))","v":20.285042509324644},{"$f":"IF($R$3=\"Spring\",N58,IF($R$3=\"Summer\",N110,IF($R$3=\"Autumn\",N162,IF($R$3=\"Winter\",N6,\"\"))))","v":0},{"$f":"IF($R$3=\"Spring\",P58,IF($R$3=\"Summer\",P110,IF($R$3=\"Autumn\",P162,IF($R$3=\"Winter\",P6,\"\"))))","v":12}]
["max charge/discharge rate in HH","00:30:00",{"$f":"'PV data'!D6","v":0},{"$f":"IF($A$10=\"Secondary School\",Data!E7,IF($A$10=\"Primary school\",Data!I7,IF($A$10=\"Retail\",Data!M7,IF($A$10=\"Leisure Centre\",Data!Q7,\"\"))))","v":17.552350993331668},{"$f":"IF(C6>D6,(C6-D6),0)","v":0},{"$f":"IF(AND((I5+E6)<$A$5,E6<=$A$7),E6,IF(E6>$A$7,$A$7,$A$5-I5))","v":0},{"$f":"IF(AND(D6>C6,I5>$A$3),IF(D6-C6<=$A$7,D6-C6,$A$7),0)","v":0},{"$f":"F6-G6","v":0},{"$f":"IF(AND(I5+H6<=$A$5,I5+H6>$A$3),LOGIC!I5+LOGIC!H6,IF(I5+H6>$A$5,$A$5,$A$3))","v":12},{"$f":"C6","v":0},{"$f":"IF($A$10=\"Secondary School\",Data!G7,IF($A$10=\"Primary school\",Data!K7,IF($A$10=\"Retail\",Data!O7,IF($A$10=\"Leisure Centre\",Data!S7,\"\"))))","v":20.285042509324644},0,{"$f":"IF(AND((P5+L6)<$A$5,L6<=$A$7),L6,IF(L6>$A$7,$A$7,$A$5-P5))","v":0},{"$f":"IF(AND(K6>J6,P5>$A$3),IF(K6-J6<=$A$7,K6-J6,$A$7),0)","v":0},{"$f":"M6-N6","v":0},{"$f":"IF(AND(P5+O6<=$A$5,P5+O6>$A$3),LOGIC!P5+LOGIC!O6,IF(P5+O6>$A$5,$A$5,$A$3))","v":12},null,"01:00:00",17.491514038415222,0,17.491514038415222,0,12,20.402303902479492,0,20.402303902479492,0,12]
[{"$f":"0.5*'Import avoidance model - RR'!N14","v":15},"01:00:00",{"$f":"'PV data'!D7","v":0},{"$f":"IF($A$10=\"Secondary School\",Data!E8,IF($A$10=\"Primary school\",Data!I8,IF($A$10=\"Retail\",Data!M8,IF($A$10=\"Leisure Centre\",Data!Q8,\"\"))))","v":17.491514038415222},0,{"$f":"IF(AND((I6+E7)<$A$5,E7<=$A$7),E7,IF(E7>$A$7,$A$7,$A$5-I6))","v":0},{"$f":"IF(AND(D7>C7,I6>$A$3),IF(D7-C7<=$A$7,D7-C7,$A$7),0)","v":0},{"$f":"F7-G7","v":0},{"$f":"IF(AND(I6+H7<=$A$5,I6+H7>$A$3),LOGIC!I6+LOGIC!H7,IF(I6+H7>$A$5,$A$5,$A$3))","v":12},0,{"$f":"IF($A$10=\"Secondary School\",Data!G8,IF($A$10=\"Primary school\",Data!K8,IF($A$10=\"Retail\",Data!O8,IF($A$10=\"Leisure Centre\",Data!S8,\"\"))))","v":20.402303902479492},0,{"$f":"IF(AND((P6+L7)<$A$5,L7<=$A$7),L7,IF(L7>$A$7,$A$7,$A$5-P6))","v":0},0,{"$f":"M7-N7","v":0},{"$f":"IF(AND(P6+O7<=$A$5,P6+O7>$A$3),LOGIC!P6+LOGIC!O7,IF(P6+O7>$A$5,$A$5,$A$3))","v":12},null,"01:30:00",17.477508952662877,0,17.477508952662877,0,12,20.378733773202136,0,20.378733773202136,0,12]
[null,"01:30:00",{"$f":"'PV data'!D8","v":0},{"$f":"IF($A$10=\"Secondary School\",Data!E9,IF($A$10=\"Primary school\",Data!I9,IF($A$10=\"Retail\",Data!M9,IF($A$10=\"Leisure Centre\",Data!Q9,\"\"))))","v":17.477508952662877},0,0,0,0,{"$f":"IF(AND(I7+H8<=$A$5,I7+H8>$A$3),LOGIC!I7+LOGIC!H8,IF(I7+H8>$A$5,$A$5,$A$3))","v":12},0,{"$f":"IF($A$10=\"Secondary School\",Data!G9,IF($A$10=\"Primary school\",Data!K9,IF($A$10=\"Retail\",Data!O9,IF($A$10=\"Leisure Centre\",Data!S9,\"\"))))","v":20.378733773202136},0,0,0,0,{"$f":"IF(AND(P7+O8<=$A$5,P7+O8>$A$3),LOGIC!P7+LOGIC!O8,IF(P7+O8>$A$5,$A$5,$A$3))","v":12},null,"02:00:00",17.498493889966461,0,17.498493889966461,0,12,20.402893155711425,0,20.402893155711425,0,12]
{"$rows_left_out":200}